{"text_format":"1","workbook":"xlsx","n_sheets":3,"sheets":["Hidden Data","Hidden Controls","Rate Convector"],"not_rendered":{"charts":0,"images":0,"macros":1,"external_links":0,"defined_names":1,"comments":0,"pivot_tables":0},"unopened":[],"bounds":{"document_bytes":16777216,"sheet_cells":100000,"rows_first":2000,"rows_last":500,"rows_between":2000,"halvings":0,"cell_chars":16384,"cell_head_chars":4096},"cells_cut":0,"cells_raw":0,"read":"whole","date_system":"1900"}

{"sheet":"Hidden Data","index":0,"n_rows":285,"n_cols":34,"rows_kept":285,"cut":false,"hidden":true,"merged":[[96,17,96,27],[97,17,97,27],[98,18,98,26],[99,18,100,19],[96,2,96,12],[97,2,97,12],[99,3,100,4],[98,3,98,11]]}
[]
[null,null,null,"CONVECTOR STEAM RATINGS"]
[null,null,null,null,null,null,null,"STEAM RATINGS IN EDR (215° AT 65° E.A.T.)"]
[null,null,null,null,null,null,"group 1",null,null,null,null,null,null,null,"group 2",null,null,null,null,null,null,null,"group 3",null,null,null,null,null,null,null,"group 4"]
[null,null,null,null,null,"FRONT OUTLET, NOMINAL LINER HEIGHT",null,null,null,null,null,null,null,"FRONT OUTLET, WALL MOUNTED, NOM. HEIGHT",null,null,null,null,null,null,null,"SLOPE TOP, FREE STANDING, NOMINAL HEIGHT",null,null,null,null,null,null,null,"SLOPE TOP, WALL MOUNTED, NOMINAL HEIGHT"]
[null,null,"DEPTH   IN   INCHES","LENGTH  IN  INCHES",null,"*TYPES FS-A, FSG-A, SR-A, SRG-A, RF-A, RFG-A, PW-A, PWG-A, FWG-A",null,null,null,null,null,null,null,"TYPE W-A",null,null,null,null,null,null,null,"*TYPE SF-A, SFG-A",null,null,null,null,null,null,null,"TYPE SW-A"]
[null,null,null,null,null,"18\"","20\"","20\"","26\"","32\"",null,null,null,"14\"","18\"","20\"","26\"","32\"",null,null,null,"18\"","20\"","24\"","26\"","32\"",null,null,null,"14\"","18\"","20\"","26\"","32\""]
[null,null,null,null,null,1,2,3,4,5,null,null,null,1,2,3,4,5,null,null,null,1,2,3,4,5,null,null,null,1,2,3,4,5]
[null,null,"4 (1)",20,1,9.3000000000000007,10.4,11.8,12.2,13,null,null,null,10.4,11.8,12.200000000000001,13,13.6,null,null,1,11.7,12.200000000000001,13,13.4,13.9,null,null,1,12.200000000000001,13,13.4,13.9,14.6]
[null,null,null,24,2,11.5,13.100000000000001,15.1,15.5,16.600000000000001,null,null,null,13.100000000000001,15.100000000000001,15.5,16.600000000000001,17.3,null,null,2,15,15.5,16.5,17,17.7,null,null,2,15.5,16.5,17,17.7,18.399999999999999]
[null,null,null,28,3,13.8,15.9,18.100000000000001,18.600000000000001,19.899999999999999,null,null,null,15.9,18.100000000000001,18.600000000000001,19.900000000000002,21,null,null,3,18,18.7,19.900000000000002,20.400000000000002,21.3,null,null,3,18.7,19.900000000000002,20.400000000000002,21.3,22.1]
[null,null,null,32,4,16.100000000000001,18.7,21.3,21.9,23.6,null,null,null,18.7,21.3,21.900000000000002,23.6,24.8,null,null,4,21.3,22.1,23.5,24,25.200000000000003,null,null,4,22.1,23.5,24,25.200000000000003,26.2]
[null,null,null,36,5,18.2,21.5,24.5,25.1,27.1,null,null,5,21.5,24.5,25.1,27.1,28.6,null,null,5,24.6,25.3,26.900000000000002,27.6,29,null,null,5,25.3,26.900000000000002,27.6,29,30.2]
[null,null,null,40,6,20.399999999999999,24.200000000000003,27.5,28.3,30.5,null,null,6,24.200000000000003,27.5,28.3,30.5,32.200000000000003,null,null,6,27.7,28.5,30.5,31.3,32.700000000000003,null,null,6,28.5,30.5,31.3,32.700000000000003,33.799999999999997]
[null,null,null,44,7,22.6,27,30.8,31.5,34,null,null,7,27,30.8,31.5,34,36,null,null,7,30.6,31.8,33.9,34.800000000000004,36.4,null,null,7,31.8,33.9,34.800000000000004,36.4,37.799999999999997]
[null,null,null,48,8,24.8,29.6,33.800000000000004,34.800000000000004,37.4,null,null,8,29.6,33.800000000000004,34.800000000000004,37.4,39.700000000000003,null,null,8,33.9,35,37.4,38.300000000000004,40.1,null,null,8,35,37.4,38.300000000000004,40.1,41.6]
[null,null,null,52,9,27.3,32.5,36.9,37.800000000000004,40.6,null,null,9,32.5,36.9,37.800000000000004,40.6,43.1,null,null,9,36.799999999999997,38.1,40.6,41.400000000000006,43.5,null,null,9,38.1,40.6,41.400000000000006,43.5,45.2]
[null,null,null,56,10,29.3,35.200000000000003,40.1,41.1,44.300000000000004,null,null,10,35.200000000000003,40.1,41.1,44.300000000000004,47.1,null,null,10,40.1,41.400000000000006,44.400000000000006,45.2,47.5,null,null,10,41.400000000000006,44.400000000000006,45.2,47.5,49.3]
[null,null,null,60,11,31.9,38,43.1,44.2,47.5,null,null,11,38,43.1,44.2,47.5,50.5,null,null,11,42.7,44.6,47.5,48.400000000000006,50.800000000000004,null,null,11,44.6,47.5,48.400000000000006,50.800000000000004,53.4]
[null,null,null,64,12,33.9,40.800000000000004,46.400000000000006,47.5,51.2,null,null,12,40.800000000000004,46.400000000000006,47.5,51.2,54.5,null,null,12,45.8,47.900000000000006,51.300000000000004,52.2,54.800000000000004,null,null,12,47.900000000000006,51.300000000000004,52.2,54.800000000000004,58]
[]
[null,null,null,null,null,1,2,3,4,5,null,null,null,1,2,3,4,5,null,null,null,1,2,3,4,5,null,null,null,1,2,3,4,5]
[null,null,"6 (2)",20,1,13.5,15.100000000000001,17.7,18.3,20.200000000000003,null,null,1,15.100000000000001,17.7,18.3,20.200000000000003,21,null,null,1,18.2,18.8,20.700000000000003,21.200000000000003,22.6,null,null,1,18.8,20.700000000000003,21.200000000000003,22.6,23.7]
[null,null,null,24,2,16.8,19,22.400000000000002,23.200000000000003,25.700000000000003,null,null,2,19,22.400000000000002,23.200000000000003,25.700000000000003,26.7,null,null,2,22.6,23.8,26.200000000000003,27,29,null,null,2,23.8,26.200000000000003,27,29,29.9]
[null,null,null,28,3,20.2,23,27,27.8,30.700000000000003,null,null,3,23,27,27.8,30.700000000000003,31.9,null,null,3,27.2,28.700000000000003,31.5,32.300000000000004,34.700000000000003,null,null,3,28.700000000000003,31.5,32.300000000000004,34.700000000000003,36.200000000000003]
[null,null,null,32,4,23.4,27,31.700000000000003,32.800000000000004,36.200000000000003,null,null,4,27,31.700000000000003,32.800000000000004,36.200000000000003,37.6,null,null,4,31.4,33.800000000000004,37.1,38,41,null,null,4,33.800000000000004,37.1,38,41,42.2]
[null,null,null,36,5,26.8,30.8,36.200000000000003,37.6,41.400000000000006,null,null,5,30.8,36.200000000000003,37.6,41.400000000000006,43.1,null,null,5,37.1,38.700000000000003,42.400000000000006,43.7,46.900000000000006,null,null,5,38.700000000000003,42.400000000000006,43.7,46.900000000000006,48.4]
[null,null,null,40,6,30.2,34.9,40.900000000000006,42.5,46.800000000000004,null,null,6,34.9,40.900000000000006,42.5,46.800000000000004,48.6,null,null,6,41.6,43.7,47.800000000000004,49.2,52.800000000000004,null,null,6,43.7,47.800000000000004,49.2,52.800000000000004,54.8]
[null,null,null,44,7,33.6,38.700000000000003,45.5,47.300000000000004,52,null,null,7,38.700000000000003,45.5,47.300000000000004,52,54.1,null,null,7,46.6,48.6,53.300000000000004,54.6,59,null,null,7,48.6,53.300000000000004,54.6,59,61.1]
[null,null,null,48,8,37,42.7,50.1,51.900000000000006,57.1,null,null,8,42.7,50.1,51.900000000000006,57.1,59.6,null,null,8,51.4,53.5,58.5,60.300000000000004,64.8,null,null,8,53.5,58.5,60.300000000000004,64.8,67.099999999999994]
[null,null,null,52,9,40.6,46.6,54.6,56.400000000000006,62.1,null,null,9,46.6,54.6,56.400000000000006,62.1,64.599999999999994,null,null,9,56.4,58.400000000000006,63.7,65.5,70.400000000000006,null,null,9,58.400000000000006,63.7,65.5,70.400000000000006,73.3]
[null,null,null,56,10,43.8,50.6,59.300000000000004,61.400000000000006,67.600000000000009,null,null,10,50.6,59.300000000000004,61.400000000000006,67.600000000000009,70.5,null,null,10,62.3,63.400000000000006,69.400000000000006,71.400000000000006,76.7,null,null,10,63.400000000000006,69.400000000000006,71.400000000000006,76.7,79.8]
[null,null,null,60,11,47.5,54.400000000000006,63.800000000000004,66,72.600000000000009,null,null,11,54.400000000000006,63.800000000000004,66,72.600000000000009,75.599999999999994,null,null,11,65.8,68.100000000000009,74.5,76.5,82.2,null,null,11,68.100000000000009,74.5,76.5,82.2,85.7]
[null,null,null,64,12,50.8,58.5,68.5,71.100000000000009,78.2,null,null,12,58.5,68.5,71.100000000000009,78.2,81.599999999999994,null,null,12,70.2,73.2,80.300000000000011,82.4,88.600000000000009,null,null,12,73.2,80.300000000000011,82.4,88.600000000000009,92]
[]
[null,null,null,null,null,1,2,3,4,5,null,null,null,1,2,3,4,5,null,null,null,1,2,3,4,5,null,null,null,1,2,3,4,5]
[null,null,"8 (3)",20,1,16.8,18.900000000000002,21,21.400000000000002,23.200000000000003,null,null,1,18.900000000000002,21,21.400000000000002,23.200000000000003,24.2,null,null,1,22.9,24,25.5,26.3,28.200000000000003,null,null,1,24,25.5,26.3,28.200000000000003,29.3]
[null,null,null,24,2,21.3,24,26.5,27.400000000000002,29.6,null,null,2,24,26.5,27.400000000000002,29.6,31.1,null,null,2,30,30.6,32.6,33.5,36.1,null,null,2,30.6,32.6,33.5,36.1,37.5]
[null,null,null,28,3,26.6,29,32,32.9,35.5,null,null,3,29,32,32.9,35.5,37.200000000000003,null,null,3,36,37,39.200000000000003,40.200000000000003,43.400000000000006,null,null,3,37,39.200000000000003,40.200000000000003,43.400000000000006,45.1]
[null,null,null,32,4,31.5,34.1,37.6,38.800000000000004,41.900000000000006,null,null,4,34.1,37.6,38.800000000000004,41.900000000000006,44,null,null,4,42.6,43.5,46.400000000000006,47.5,51.300000000000004,null,null,4,43.5,46.400000000000006,47.5,51.300000000000004,53.3]
[null,null,null,36,5,36.299999999999997,39.1,43.300000000000004,44.6,48.1,null,null,5,39.1,43.300000000000004,44.6,48.1,50.5,null,null,5,49,50.2,55.2,54.6,58.900000000000006,null,null,5,50.2,55.2,54.6,58.900000000000006,61.2]
[null,null,null,40,6,41.1,44.300000000000004,49,50.300000000000004,54.400000000000006,null,null,6,44.300000000000004,49,50.300000000000004,54.400000000000006,56.9,null,null,6,55,56.5,60.1,61.800000000000004,66.600000000000009,null,null,6,56.5,60.1,61.800000000000004,66.600000000000009,69.099999999999994]
[null,null,null,44,7,46,49.300000000000004,54.400000000000006,56,60.6,null,null,7,49.300000000000004,54.400000000000006,56,60.6,63.3,null,null,7,61.6,63,66.8,68.8,74,null,null,7,63,66.8,68.8,74,76.8]
[null,null,null,48,8,49.8,53.900000000000006,60,61.7,67,null,null,8,53.900000000000006,60,61.7,67,70,null,null,8,68,69.5,73.8,74.600000000000009,81.7,null,null,8,69.5,73.8,74.600000000000009,81.7,84.9]
[null,null,null,52,9,56.1,59.300000000000004,65.3,67.100000000000009,72.600000000000009,null,null,9,59.300000000000004,65.3,67.100000000000009,72.600000000000009,75.599999999999994,null,null,9,73.8,75.8,80.2,82.300000000000011,88.9,null,null,9,75.8,80.2,82.300000000000011,88.9,92.6]
[null,null,null,56,10,60.9,64.600000000000009,71.2,73.2,79.2,null,null,10,64.600000000000009,71.2,73.2,79.2,82.7,null,null,10,80.7,82.300000000000011,87.5,89.800000000000011,96.9,null,null,10,82.300000000000011,87.5,89.800000000000011,96.9,100.9]
[null,null,null,60,11,65.7,69.400000000000006,76.400000000000006,78.5,84.9,null,null,11,69.400000000000006,76.400000000000006,78.5,84.9,88.4,null,null,11,86.4,88.7,93.800000000000011,96.300000000000011,104,null,null,11,88.7,93.800000000000011,96.300000000000011,104,108.5]
[null,null,null,64,12,69.900000000000006,74.5,82.300000000000011,84.7,91.5,null,null,12,74.5,82.300000000000011,84.7,91.5,95.4,null,null,12,93.3,95.4,101.10000000000001,103.9,112,null,null,12,95.4,101.10000000000001,103.9,112,116.7]
[]
[]
[null,null,null,"group1depth4rating=",{"$f":"HLOOKUP('Hidden Controls'!L4,'Hidden Data'!F8:J20,'Hidden Controls'!I4+1,FALSE)","v":9.3000000000000007},null,null,null,null,null,null,null,null,"group2depth4rating=",{"$f":"HLOOKUP('Hidden Controls'!L4,'Hidden Data'!N8:R20,'Hidden Controls'!I4+1,FALSE)","v":10.4},null,null,null,null,null,null,null,"group3depth4rating=",{"$f":"HLOOKUP('Hidden Controls'!L4,'Hidden Data'!V8:Z20,'Hidden Controls'!I4+1,FALSE)","v":11.7},null,null,null,null,null,"group4depth4rating=",{"$f":"HLOOKUP('Hidden Controls'!L4,'Hidden Data'!AD8:AH20,'Hidden Controls'!I4+1,FALSE)","v":12.200000000000001}]
[null,null,null,"group1depth6rating=",{"$f":"HLOOKUP('Hidden Controls'!L4,'Hidden Data'!F22:J34,'Hidden Controls'!I4+1,FALSE)","v":13.5},null,null,null,null,null,null,null,null,"group2depth6rating=",{"$f":"HLOOKUP('Hidden Controls'!L4,'Hidden Data'!N22:R34,'Hidden Controls'!I4+1,FALSE)","v":15.100000000000001},null,null,null,null,null,null,null,"group3depth6rating=",{"$f":"HLOOKUP('Hidden Controls'!L4,'Hidden Data'!V22:Z34,'Hidden Controls'!I4+1,FALSE)","v":18.2},null,null,null,null,null,"group4depth6rating=",{"$f":"HLOOKUP('Hidden Controls'!L4,'Hidden Data'!AD22:AH34,'Hidden Controls'!I4+1,FALSE)","v":18.8}]
[null,null,null,"group1depth8rating=",{"$f":"HLOOKUP('Hidden Controls'!L4,'Hidden Data'!F36:J48,'Hidden Controls'!I4+1,FALSE)","v":16.8},null,null,null,null,null,null,null,null,"group2depth8rating=",{"$f":"HLOOKUP('Hidden Controls'!L4,'Hidden Data'!N36:R48,'Hidden Controls'!I4+1,FALSE)","v":18.900000000000002},null,null,null,null,null,null,null,"group3depth8rating=",{"$f":"HLOOKUP('Hidden Controls'!L4,'Hidden Data'!V36:Z48,'Hidden Controls'!I4+1,FALSE)","v":22.9},null,null,null,null,null,"group4depth8rating=",{"$f":"HLOOKUP('Hidden Controls'!L4,'Hidden Data'!AD36:AH48,'Hidden Controls'!I4+1,FALSE)","v":24}]
[null,null,null,"group1selected depth rating =",{"$f":"IF('Hidden Controls'!F4=1,'Hidden Data'!E51,IF('Hidden Controls'!F4=2,'Hidden Data'!E52,'Hidden Data'!E53))","v":9.3000000000000007},null,null,null,null,null,null,null,null,"group2selected depth rating =",{"$f":"IF('Hidden Controls'!F4=1,'Hidden Data'!O51,IF('Hidden Controls'!F4=2,'Hidden Data'!O52,'Hidden Data'!O53))","v":10.4},null,null,null,null,null,null,null,"group3selected depth rating =",{"$f":"IF('Hidden Controls'!F4=1,'Hidden Data'!X51,IF('Hidden Controls'!F4=2,'Hidden Data'!X52,'Hidden Data'!X53))","v":11.7},null,null,null,null,null,"group4selected depth rating =",{"$f":"IF('Hidden Controls'!F4=1,'Hidden Data'!AE51,IF('Hidden Controls'!F4=2,'Hidden Data'!AE52,'Hidden Data'!AE53))","v":12.200000000000001}]
[]
[null,null,null,null,null,null,null,null,null,null,"unit specific rating (EDR) =",{"$f":"IF('Hidden Controls'!C4=13, 'Hidden Data'!O54,IF(OR('Hidden Controls'!C4=8,'Hidden Controls'!C4=9),'Hidden Data'!X54,IF('Hidden Controls'!C4=12,'Hidden Data'!AE54,'Hidden Data'!E54)))","v":9.3000000000000007}]
[]
[null,null,null,null,"Hot Water Correction Factors",null,null,null,null,null,null,"Steam Correction Factor"]
[null,null,null,"index",1,2,3,4,5,null,"index",1,2,3,4,5,6,7]
[null,null,"index",null,55,60,65,70,75,null,"psig",0.89900000000000002,5,10,15,20,25,50]
{"$rows_left_out":226}
{"sheet":"Hidden Controls","index":1,"n_rows":95,"n_cols":19,"rows_kept":95,"cut":false,"hidden":true,"merged":[]}
[]
[]
[null,"Convector type",null,null,"Convector Depth",null,null,"Convector Length",null,null,"convector height",null,null,null,"convector height",null,"FS-A, FSG-A, FWG-A, RF-A, RFG-A, SF-A, SFG-A"]
[1,"FS-A",1,null,4,1,null,20,1,null,{"$f":"IF(OR(C4=4, C4=5),18,IF(OR(C4=10, C4=11),16,IF(OR(C4=12, C4=13),14,18)))","v":18},1,null,null,18,null,"1,2,3,6,7,8,9"]
[2,"FSG-A",null,null,6,null,null,24,null,null,{"$f":"IF(OR(C4=4, C4=5),20,IF(OR(C4=10, C4=11),18,IF(OR(C4=12, C4=13),18,20)))","v":20},null,null,null,20]
[3,"FWG-A",null,null,8,null,null,28,null,null,{"$f":"IF(OR(C4=4, C4=5),24,IF(OR(C4=10, C4=11),22,IF(OR(C4=12, C4=13),20,24)))","v":24},null,null,null,24]
[4,"PW-A",null,null,null,null,null,32,null,null,{"$f":"IF(OR(C4=4, C4=5),26,IF(OR(C4=10, C4=11),24,IF(OR(C4=12, C4=13),26,26)))","v":26},null,null,null,26]
[5,"PWG-A",null,null,null,null,null,36,null,null,{"$f":"IF(OR(C4=4, C4=5),28,IF(OR(C4=10, C4=11),30,IF(OR(C4=12, C4=13),32,32)))","v":32},null,null,null,32]
[6,"RF-A",null,null,"min flow limit",null,null,40]
[7,"RFG-A",null,null,{"$f":"IF(F4=1,0.15,IF(F4=2,0.225,0.3))","v":0.15},null,null,44]
[8,"SF-A",null,null,null,null,null,48,null,null,null,null,null,null,"convector height",null,"PW-A, PWG-A"]
[9,"SFG-A",null,null,null,null,null,52,null,null,null,null,null,null,18,null,"4,5"]
[10,"SR-A",null,null,null,null,null,56,null,null,null,null,null,null,20]
[11,"SRG-A",null,null,null,null,null,60,null,null,null,null,null,null,24]
[12,"SW-A",null,null,null,null,null,64,null,null,null,null,null,null,26]
[13,"W-A",null,null,null,null,null,null,null,null,null,null,null,null,28]
[]
[]
[null,"lh end pocket",null,false,"true= pocket, false = no pocket",null,null,null,null,"Fluid Selection",null,null,null,null,"convector height",null,"SR-A, SRG-A"]
[null,"rh end pocket",null,false,null,null,null,null,null,"Water",null,1,null,null,16,null,"10,11"]
[null,null,null,null,null,null,null,null,null,"Proplyene Glycol Mix",null,null,null,null,18]
[null,"lh access door",null,null,"rh access door",null,null,null,null,"Ethylene Glycol Mix",null,null,null,null,22]
[null,"#3",false,null,"#4",false,null,null,null,null,null,null,null,null,24]
[null,"#1",false,null,"#2",false,null,null,null,null,null,null,null,null,30]
[null,"#5",false,null,"#6",false]
[]
[null,null,null,null,null,null,null,null,null,null,null,null,null,null,"convector height",null,"SW-A, W-A"]
[null,null,null,null,null,"height",null,null,null,null,null,null,null,null,14,null,"12,13"]
[null,"Grille Derate",null,null," 16, 18",20,"22, 24",26,"28, 30, 32",null,null,null,null,null,18]
[null,null,null,null,1,2,3,4,5,null,null,null,null,null,20]
[null,null,4,1,0.97,0.97,0.98,0.98,0.99,null,null,null,null,null,26]
[null,"depth",6,2,0.94,0.94,0.95,0.95,0.98,null,null,null,null,null,32]
[null,null,8,3,0.91,0.91,0.93,0.93,0.97]
[]
[null,null,"temp grille derate factor = ",{"$f":"HLOOKUP(L4,E30:I33,1+F4,FALSE)","v":0.97},null,null,"final grille factor =",{"$f":"IF(OR(C4=2, C4=3, C4=5, C4=7, C4=9, C4=11),D35,1)","v":1}]
[]
[null,"Access Door Derate"]
[null,"FS-A, FSG-A, SF-A, SFG-A, SW-A, W-A",null,null,null,null,null,null,null,null,null,"FWG-A, PW-A, PWG-A, RF-A, RFG-A, SR-A, SRG-A"]
[null,null,null,"non recessed =",{"$f":"IF(OR(C4=1, C4=2, C4=8, C4=9, C4=12, C4=13), TRUE,FALSE)","v":true},null,null,null,null,null,null,null,null,"recessed = ",{"$f":"IF(E39=TRUE,FALSE,TRUE)","v":false}]
[null,null,null,null,"door sum = lh choice plus rh choice",null,null,null,null,null,null,null,null,null,"door sum = lh choice plus rh choice"]
[null,null,null,"3 or 4","3 & 4",null,null,"5 or 6","5 & 6",null,null,null,null,"3 or 4","3 & 4",null,null,"5 or 6","5 & 6"]
[null,null,null,3,6,null,null,4,8,null,null,null,null,3,6,null,null,4,8]
[null,20,1,0.94,0.88,null,1,0.82,0.65,null,null,20,1,0.97499999999999998,0.95,null,1,0.92500000000000004,0.85]
[null,24,2,0.95,0.91,null,2,0.86,0.72,null,null,24,2,0.98,0.96,null,2,0.94,0.88]
[null,28,3,0.96,0.92,null,3,0.89,0.77,null,null,28,3,0.98199999999999998,0.96799999999999997,null,3,0.94799999999999995,0.90200000000000002]
[null,32,4,0.97,0.94,null,4,0.89,0.8,null,null,32,4,0.98499999999999999,0.97199999999999998,null,4,0.95499999999999996,0.91800000000000004]
[null,36,5,0.97,0.94,null,5,0.92,0.83,null,null,36,5,0.98799999999999999,0.97499999999999998,null,5,0.96199999999999997,0.92500000000000004]
[null,40,6,0.97,0.95,null,6,0.92,0.85,null,null,40,6,0.99,0.97799999999999998,null,6,0.97,0.93200000000000005]
[null,44,7,0.98,0.95,null,7,0.93,0.86,null,null,44,7,0.99,0.98,null,7,0.97,0.94]
[null,48,8,0.98,0.96,null,8,0.94,0.88,null,null,48,8,0.99,0.98199999999999998,null,8,0.97,0.94799999999999995]
[null,52,9,0.98,0.96,null,9,0.95,0.89,null,null,52,9,0.99199999999999999,0.98499999999999999,null,9,0.97799999999999998,0.95499999999999996]
[null,56,10,0.98,0.96,null,10,0.95,0.89,null,null,56,10,0.99199999999999999,0.98499999999999999,null,10,0.97799999999999998,0.95499999999999996]
[null,60,11,0.98,0.97,null,11,0.95,0.9,null,null,60,11,0.99199999999999999,0.98499999999999999,null,11,0.97799999999999998,0.95499999999999996]
[null,64,12,0.98,0.97,null,12,0.95,0.91,null,null,64,12,0.99199999999999999,0.98799999999999999,null,12,0.97799999999999998,0.96199999999999997]
[]
[null,null,"3/4 door sum ",{"$f":"IF(D19=TRUE,0,IF(C23=TRUE,3,0))+IF(D20=TRUE,0,IF(F23=TRUE,3,0))","v":0},null,null,"5/6 door sum ",{"$f":"IF(D19=TRUE,0,IF(C25=TRUE,4,0))+IF(D20=TRUE,0,IF(F25=TRUE,4,0))","v":0}]
[null,null,"temp 3/4 door derate 1 =",{"$f":"IF(OR(D56=3, D56=6),HLOOKUP(D56,D42:E54,I4+1,FALSE),1)","v":1},null,null,null,null,null,null,null,null,"temp 3/4 door derate 2 =",{"$f":"IF(OR(D56=3, D56=6),HLOOKUP(D56,N42:O54,I4+1,FALSE),1)","v":1}]
[null,null,"temp 5/6 door derate 1 =",{"$f":"IF(OR(H56=4, H56=8),HLOOKUP(H56,H42:I54,I4+1,FALSE),1)","v":1},null,null,null,null,null,null,null,null,"temp 5/6 door derate 2 =",{"$f":"IF(OR(H56=4, H56=8),HLOOKUP(H56,R42:S54,I4+1,FALSE),1)","v":1}]
[null,null,"temp combined derate 1 =",{"$f":"D57*D58","v":1},null,null,null,null,null,null,null,null,"temp combined derate 2 =",{"$f":"N57*N58","v":1}]
[null,null,null,null,null,null,"Final access door derate factor =",{"$f":"IF(E39=TRUE,D59,IF(O39=TRUE,N59,1))","v":1}]
{"$rows_left_out":36}
{"sheet":"Rate Convector","index":2,"n_rows":30,"n_cols":12,"rows_kept":30,"cut":false,"hidden":false,"merged":[[0,2,1,11],[26,2,26,5],[5,7,5,10],[3,7,3,10],[7,7,7,10],[13,7,13,11],[9,2,9,5],[16,2,16,5],[20,2,20,5],[3,2,3,4],[22,7,23,11],[13,2,13,5]]}
[null,null,"Mestek Convector Rating Spreadsheet"]
[]
[]
[null,null,"Convector  Selection Inputs",null,null,null,null,"End Pocket Selection"]
[null,null,"Type"]
[null,null,"Depth",null,null,null,null,{"$f":"'Hidden Controls'!D95","v":""}]
[null,null,"Length"]
[null,null,"Height",null,null,null,null,"Access Door Selection"]
[]
["Cell",null,"Standard Condition   215°F @ 65°F EAT"]
["Legend",null,null,"Heat Capacity",{"$f":"MROUND(E12*240,5)","v":2230},"BTUH"]
["Input",null,null,"Heat Capacity",{"$f":"'Hidden Data'!L56*L16*L17","v":9.3000000000000007},"EDR",null,{"$f":"IF('Hidden Controls'!B79=1,\"Access Door location chosen is unavailable\",\"\")","v":""}]
["Output"]
["Reference",null,"Common Condition",null,null,null,null,"Applied Deratings"]
[null,null,null,"Altitude",0,"Feet",null,null,null,null,"Altitude derate factor",{"$f":"'Hidden Data'!F279","v":1}]
[null,null,null,null,null,null,null,null,null,null,"Inlet Grille derate factor",{"$f":"'Hidden Controls'!H35","v":1}]
[null,null,"Steam Ratings",null,null,null,null,null,null,null,"Access Door derate factor",{"$f":"'Hidden Controls'!H60","v":1}]
[null,null,null,"Steam Pressure",0.89900000000000002,"PSIG",null,null,null,null,"Steam Pressure correction factor",{"$f":"'Hidden Data'!L68","v":1}]
[null,null,null,"Steam Unit Capacity",{"$f":"E11*L18*L15","v":2230},"BTUH",null,null,null,null,"Water/Air Temp correction factor",{"$f":"'Hidden Data'!C90","v":1}]
[null,null,null,null,null,null,null,null,null,null,"Fluid Temp Drop correction factor",{"$f":"'Hidden Data'!F267","v":1}]
[null,null,"Hot Water Ratings",null,null,null,null,null,null,null,"Glycol correction factor",{"$f":"'Hidden Data'!Q131","v":1}]
[null,null,null,"Entering Air Temp",65]
[null,null,"Fluid",null,null,null,null,{"$f":"IF('Hidden Controls'!L20=3,\"Ethylene Glycol is NOT recognized or approved for use by USDA and other health agencies.\",\"\")","v":""}]
[null,null,null,"Average Fluid Temp",215,"°F"]
[null,null,null,"Fluid Temp Drop",20,"°F"]
["MDG",null,null," Glycol",0,"%",null,{"$f":"IF(H27=\"\",\"Flow is above minimum flow limit\",\"\")","v":"Flow is above minimum flow limit"}]
["11/2019",null,{"$f":"IF(AND(E26<>0,'Hidden Controls'!L20=1),\"Glycol & Fluid Mismatch - Glycol Ignored\",\"\")","v":""},null,null,null,null,{"$f":"IF(E29<J28,\"Warning - Laminar Flow\",\"\")","v":""}]
[null,null,"Water Unit Capacity",null,{"$f":"E11*L19*L20*L21*L15","v":2230},"BTUH",null,null,"Min. Flow Limit =",{"$f":"'Hidden Data'!G252","v":0.14370045678081256},"GPM"]
[null,null,null,"Fluid Flow Rate",{"$f":"E28/(500*E25)","v":0.223},"GPM",null,{"$f":"IF('Hidden Data'!C164=1,\"* flow rate exceeds highest flow rate on pressure\",\"\")","v":""}]
[null,null,null,"Pressure Loss",{"$f":"'Hidden Data'!C163","v":3.9247999999999998E-2},"FT H2O",null,{"$f":"IF('Hidden Data'!C164=1,\"loss chart - unable to calculate\",\"\")","v":""}]